BDBM231468 US9346798, 215
SMILES Fc1cc2N(CCOc2cc1S(=O)(=O)Nc1nccs1)c1ccc(cc1C#N)C(F)(F)F
InChI Key InChIKey=YYWBVRDWEWYDOV-UHFFFAOYSA-N
Data  10 IC50
  Tab Delimited (TSV)   2D SDfile   Computed 3D by Vconf -m prep SDfile
Find this compound or compounds like it in BindingDB:
Activity Spreadsheet -- Enzyme Inhibition Constant Data from BindingDB
Found 10 hits for monomerid = 231468
TargetSodium channel protein type 5 subunit alpha(Homo sapiens (Human))
Amgen
US Patent
LigandPNGBDBM231468(US9346798, 215)
Affinity DataIC50:  203nM. Assay description: HEK 293 cells stably transfected with either Nav 1.7 or with Nav 1.5 were recorded in population patch-clamp mode with the IonWorks® Quattro auto...
Ligand InfoPC cidPC sid
In DepthDetails US Patent
TargetSodium channel protein type 9 subunit alpha(Homo sapiens (Human))
Amgen
US Patent
LigandPNGBDBM231468(US9346798, 215)
Affinity DataIC50:  9.86nM. Assay description: HEK 293 cells stably transfected with either Nav 1.7 or with Nav 1.5 were recorded in population patch-clamp mode with the IonWorks® Quattro auto...
Ligand InfoPC cidPC sid
In DepthDetails US Patent
TargetSodium channel protein type 9 subunit alpha(Homo sapiens (Human))
Amgen
US Patent
LigandPNGBDBM231468(US9346798, 215)
Affinity DataIC50:  183nM. Assay description: HEK 293 cells stably transfected with human Nav1.7 were recorded in whole cell voltage clamp mode with the PatchXpress automated electrophysiology sy...
Ligand InfoPC cidPC sid
In DepthDetails US Patent
TargetSodium channel protein type 9 subunit alpha(Homo sapiens (Human))
Amgen
US Patent
LigandPNGBDBM231468(US9346798, 215)
Affinity DataIC50:  37nM. Assay description: Displacement of (P)-1-(30-chloro-2-fluoro-5,50-dimethoxy-[1,10biphenyl]-4-yl)-N-(isoxazol-3-yl)-2-oxo-1,2-dihydroquinoline-6-sulfonamide[50-methoxy-C...
Ligand InfoPC cidPC sid
In DepthDetails ArticlePubMed
TargetSodium channel protein type 9 subunit alpha(Rattus norvegicus)
Amgen
Curated by ChEMBL
LigandPNGBDBM231468(US9346798, 215)
Affinity DataIC50:  67nM. Assay description: Inhibition of rat NaV1.7 by cell based whole cell voltage clamp method
Ligand InfoPC cidPC sid
In DepthDetails ArticlePubMed
TargetSodium channel protein type 10 subunit alpha(Rattus norvegicus (Rat))
Amgen
Curated by ChEMBL
LigandPNGBDBM231468(US9346798, 215)
Affinity DataIC50: >3.00E+4nM. Assay description: Inhibition of NaV1.8 in rat DRG neurons assessed as reduction in tetrodotoxin-sensitive sodium channel currents at holding potential of -140 mV by ma...
Ligand InfoPC cidPC sid
In DepthDetails ArticlePubMed
TargetSodium channel protein type 10 subunit alpha(Mus musculus)
Amgen
Curated by ChEMBL
LigandPNGBDBM231468(US9346798, 215)
Affinity DataIC50:  5.30E+4nM. Assay description: Inhibition of NaV1.8 in C57BL/6 mouse DRG neurons assessed as reduction in tetrodotoxin-sensitive sodium channel currents at holding potential of -14...
Ligand InfoPC cidPC sid
In DepthDetails ArticlePubMed
TargetSodium channel protein type 5 subunit alpha(Homo sapiens (Human))
Amgen
US Patent
LigandPNGBDBM231468(US9346798, 215)
Affinity DataIC50:  320nM. Assay description: Inhibition of human NaV1.5 expressed in HEK295 cells at holding potential of -125 mV with test potentials to -10 mV by whole cell voltage clamp metho...
Ligand InfoPC cidPC sid
In DepthDetails ArticlePubMed
TargetSodium channel protein type 9 subunit alpha(Mus musculus)
Amgen
Curated by ChEMBL
LigandPNGBDBM231468(US9346798, 215)
Affinity DataIC50:  60nM. Assay description: Inhibition of mouse NaV1.7 by whole cell voltage clamp method
Ligand InfoPC cidPC sid
In DepthDetails ArticlePubMed
TargetSodium channel protein type 9 subunit alpha(Homo sapiens (Human))
Amgen
US Patent
LigandPNGBDBM231468(US9346798, 215)
Affinity DataIC50:  140nM. Assay description: Inhibition of human NaV1.7 expressed in HEK293 cells at holding potential of -125 mV with test potentials to -10 mV by whole cell voltage clamp metho...
Ligand InfoPC cidPC sid
In DepthDetails ArticlePubMed