BDBM231630 GSK3
SMILES CCSc1nnc(C2CCCN(CC(=O)Nc3cc(ccc3Cl)C(F)(F)F)C2)n1CC
InChI Key InChIKey=NFVJNJQRWPQVOA-UHFFFAOYSA-N
Data  2 IC50
  Tab Delimited (TSV)   2D SDfile   Computed 3D by Vconf -m prep SDfile
Find this compound or compounds like it in BindingDB:
Activity Spreadsheet -- Enzyme Inhibition Constant Data from BindingDB
Found 2 hits for monomerid = 231630
TargetDihydroorotate dehydrogenase (quinone), mitochondrial(Homo sapiens (Human))
Harvard School Of Public Health
LigandPNGBDBM231630(GSK3)
Affinity DataIC50: >3.00E+4nM. Assay description: Substrate-dependent inhibition of recombinant PfDHODH protein was assessed in an in vitro assay in 384-well clear plates (Corning 3702) as described ...
In DepthDetails ArticlePubMed
TargetDihydroorotate dehydrogenase (quinone), mitochondrial(Plasmodium falciparum (isolate 3D7))
Harvard School Of Public Health
LigandPNGBDBM231630(GSK3)
Affinity DataIC50:  1.70E+3nM. Assay description: Substrate-dependent inhibition of recombinant PfDHODH protein was assessed in an in vitro assay in 384-well clear plates (Corning 3702) as described ...
In DepthDetails ArticlePubMed