BDBM231637 Methyl-4-hydroxyphenylacetic acid
SMILES CC(C(O)=O)c1ccc(O)cc1
InChI Key InChIKey=ZHMMPVANGNPCBW-UHFFFAOYSA-N
Data  1 EC50
  Tab Delimited (TSV)   2D SDfile   Computed 3D by Vconf -m prep SDfile
Find this compound or compounds like it in BindingDB:
Activity Spreadsheet -- Enzyme Inhibition Constant Data from BindingDB
Found 1 hit for monomerid = 231637
TargetOlfactory receptor class A-like protein 1(Danio rerio (Zebrafish))
German Institute Of Human Nutrition Potsdam-Rehbruecke
LigandPNGBDBM231637(Methyl-4-hydroxyphenylacetic acid)
Affinity DataEC50:  2.21E+5nMpH: 7.4Assay Description:Briefly, HEK 293T cells stably expressing the G protein-chimera Gα16gust44 were seeded onto 96-well plates coated with 10 μg/ml of poly-D-l...
In DepthDetails ArticlePubMed