BDBM231956 US9340517, 343
SMILES Clc1cc(Cl)cc(CN2CC[C@@H](CNC(=O)c3ccc(Cl)c(Cl)c3)N[C@@H](CCN3CCCCC3)C2=O)c1
InChI Key InChIKey=YFLPFLHCCYJVCQ-DHLKQENFSA-N
Data  1 IC50
  Tab Delimited (TSV)   2D SDfile   Computed 3D by Vconf -m prep SDfile
Find this compound or compounds like it in BindingDB:
Activity Spreadsheet -- Enzyme Inhibition Constant Data from BindingDB
Found 1 hit for monomerid = 231956
TargetMelanocortin receptor 5(Homo sapiens (Human))
Mimetica
US Patent
LigandPNGBDBM231956(US9340517, 343)
Affinity DataIC50: <100nMpH: 7.4 T: 2°C. Assay description: Assessments of compound binding to human MC5R (hMC5R)) by displacement of an 125I-labeled NDP-MSH receptor ligand peptide were performed essentially ...
Ligand InfoPC cidPC sid
In DepthDetails US Patent