BDBM232061 US9340517, 449
SMILES CC[C@H](CN1CC[C@H](CNC(=O)c2ccc(Cl)c(Cl)c2)N[C@H](CCN(CC)CC)C1=O)c1ccccc1
InChI Key InChIKey=OCJDGMQUGOBDQZ-GNMGOMLTSA-N
Data  1 IC50
  Tab Delimited (TSV)   2D SDfile   Computed 3D by Vconf -m prep SDfile
Find this compound or compounds like it in BindingDB:
Activity Spreadsheet -- Enzyme Inhibition Constant Data from BindingDB
Found 1 hit for monomerid = 232061
TargetMelanocortin receptor 5(Homo sapiens (Human))
Mimetica
US Patent
LigandPNGBDBM232061(US9340517, 449)
Affinity DataIC50: <100nMpH: 7.4 T: 2°C. Assay description: Assessments of compound binding to human MC5R (hMC5R)) by displacement of an 125I-labeled NDP-MSH receptor ligand peptide were performed essentially ...
Ligand InfoPC cidPC sid
In DepthDetails US Patent