BDBM2328 2-(cyclohexylsulfanyl)-6-(1-phenylpropyl)-3,4-dihydropyrimidin-4-one::S-DABO::thio-DABO 3dd
SMILES CCC(c1ccccc1)c1cc(=O)[nH]c(SC2CCCCC2)n1
InChI Key InChIKey=FGMXMULQDHJUFC-UHFFFAOYSA-N
Data  1 IC50
  Tab Delimited (TSV)   2D SDfile   Computed 3D by Vconf -m prep SDfile
Find this compound or compounds like it in BindingDB:
Activity Spreadsheet -- Enzyme Inhibition Constant Data from BindingDB
Found 1 hit for monomerid = 2328
TargetGag-Pol polyprotein [588-1027]/[588-1147](Human immunodeficiency virus type 1)
Sapienza University Of Rome
LigandPNGBDBM2328(2-(cyclohexylsulfanyl)-6-(1-phenylpropyl)-3,4-dihy...)
Affinity DataIC50:  3.70E+3nMpH: 7.8 T: 2°C. Assay description: The IC50 of reverse transcriptase is the concentration that inhibits 50% of recombinant HIV-1 RT RNA-directed DNA polymerase activity in vitro.
In DepthDetails ArticlePubMed