BDBM233335 Sodium 6-chloro-7-(4-(2-fluorophenethylcarbamoyl)phenoxy)chroman-4-carboxylate::US9556139, 153
SMILES OC(=O)C1CCOc2cc(Oc3ccc(cc3)C(=O)NCCc3ccccc3F)c(Cl)cc12
InChI Key InChIKey=ZDSWNDQFVNGCFR-UHFFFAOYSA-N
Data  1 EC50
  Tab Delimited (TSV)   2D SDfile   Computed 3D by Vconf -m prep SDfile
Find this compound or compounds like it in BindingDB:
Activity Spreadsheet -- Enzyme Inhibition Constant Data from BindingDB
Found 1 hit for monomerid = 233335
TargetProstaglandin D2 receptor 2(Homo sapiens (Human))
Array Biopharma
US Patent
LigandPNGBDBM233335(Sodium 6-chloro-7-(4-(2-fluorophenethylcarbamoyl)p...)
Affinity DataEC50:  521nMpH: 7.4 T: 2°C. Assay description: The coding sequence of human DP2 was introduced into the human Leukemic cell line K562 by electroporation and stable clones expressing DP2 were obtai...
Ligand InfoPC cidPC sid
In DepthDetails US Patent