BDBM234297 Met-ψ[P(O)(OH)CH2]-Ala (5)
SMILES CSCCC(N)P(O)(=O)CC(C)C(O)=O
InChI Key InChIKey=KVCYRBIAXSOETM-UHFFFAOYSA-N
Data  1 KI
  Tab Delimited (TSV)   2D SDfile   Computed 3D by Vconf -m prep SDfile
Find this compound or compounds like it in BindingDB:
Activity Spreadsheet -- Enzyme Inhibition Constant Data from BindingDB
Found 1 hit for monomerid = 234297
TargetCytosol aminopeptidase [33-68,L62W](Sus scrofa (Pig))
Academy Of Sciences Of The Czech Republic
LigandPNGBDBM234297(Met-ψ[P(O)(OH)CH2]-Ala (5))
Affinity DataKi:  3.64E+3nM ΔG°:  -7.41kcal/molepH: 8.4 T: 2°C. Assay description: LAP was assayed in 75 mM triethanolamine hydrochloride buffer (pH = 8.4, containing 5 mM MgCl2) at 25°C. The substrate (L-leucine-p-nitroanilide) was...
Ligand InfoPC cidPC sid
In DepthDetails ArticlePubMed