BDBM234298 Nle-ψ[P(O)(OH)O]-L-Ala (6)
SMILES CCCCC(N)P(O)(=O)O[C@@H](C)C(O)=O
InChI Key InChIKey=HEXDEEBLYNYECL-PKPIPKONSA-N
Data  1 KI
  Tab Delimited (TSV)   2D SDfile   Computed 3D by Vconf -m prep SDfile
Find this compound or compounds like it in BindingDB:
Activity Spreadsheet -- Enzyme Inhibition Constant Data from BindingDB
Found 1 hit for monomerid = 234298
TargetCytosol aminopeptidase [33-68,L62W](Sus scrofa (Pig))
Academy Of Sciences Of The Czech Republic
LigandPNGBDBM234298(Nle-ψ[P(O)(OH)O]-L-Ala (6))
Affinity DataKi:  2.69E+5nM ΔG°:  -4.87kcal/molepH: 8.4 T: 2°C. Assay description: LAP was assayed in 75 mM triethanolamine hydrochloride buffer (pH = 8.4, containing 5 mM MgCl2) at 25°C. The substrate (L-leucine-p-nitroanilide) was...
Ligand InfoPC cidPC sid
In DepthDetails ArticlePubMed