BDBM23441 4-(heptyloxy)-3-hydroxybenzoate::benzoic acid derivative, 10
SMILES CCCCCCCOc1ccc(cc1O)C([O-])=O
InChI Key InChIKey=UXVWKUJCNCLAKT-UHFFFAOYSA-M
Data  1 Kd
  Tab Delimited (TSV)   2D SDfile   Computed 3D by Vconf -m prep SDfile
Find this compound or compounds like it in BindingDB:
Activity Spreadsheet -- Enzyme Inhibition Constant Data from BindingDB
Found 1 hit for monomerid = 23441
TargetUDP-3-O-acyl-N-acetylglucosamine deacetylase(Aquifex aeolicus)
University Of San Francisco
LigandPNGBDBM23441(4-(heptyloxy)-3-hydroxybenzoate | benzoic acid der...)
Affinity DataKd:  9.00E+3nMpH: 7.0 T: 2°C. Assay description: Ligand binding to A. aeolicus LpxC was assayed by isothermal titration using isothermal microcalorimeter from Microcal, Inc. (Northampton, MA). The e...
In DepthDetails ArticlePubMed