BDBM234684 US9353102, 6.1
SMILES OC(=O)C1=C(CCC1)C(=O)Nc1sccc1-c1nc(no1)C1CC1
InChI Key InChIKey=ACTRFALXAIUYJS-UHFFFAOYSA-N
Data  2 IC50
  Tab Delimited (TSV)   2D SDfile   Computed 3D by Vconf -m prep SDfile
Find this compound or compounds like it in BindingDB:
Activity Spreadsheet -- Enzyme Inhibition Constant Data from BindingDB
Found 2 hits for monomerid = 234684
TargetFatty acid-binding protein 5(Homo sapiens (Human))
Hoffmann-La Roche
US Patent
LigandPNGBDBM234684(US9353102, 6.1)
Affinity DataIC50:  890nMpH: 7.5Assay Description:Stock DMSO solutions (1.8 mM) of compounds were serially diluted 3-fold for ten concentrations with 100% DMSO (50 μM to 0.003 μM final comp...
Ligand InfoPC cidPC sid
In DepthDetails US Patent
TargetFatty acid-binding protein, adipocyte(Homo sapiens (Human))
Hoffmann-La Roche
US Patent
LigandPNGBDBM234684(US9353102, 6.1)
Affinity DataIC50:  10nMpH: 7.5Assay Description:Stock DMSO solutions (1.8 mM) of compounds were serially diluted 3-fold for ten concentrations with 100% DMSO (50 μM to 0.003 μM final comp...
Ligand InfoPC cidPC sid
In DepthDetails US Patent