BDBM234686 US9353102, 6.3
SMILES Cc1c(sc(NC(=O)C2=C(CCCC2)C(O)=O)c1-c1nc(no1)C1CC1)C1COC1
InChI Key InChIKey=QSUGARZWUOPBOO-UHFFFAOYSA-N
Data  2 IC50
  Tab Delimited (TSV)   2D SDfile   Computed 3D by Vconf -m prep SDfile
Find this compound or compounds like it in BindingDB:
Activity Spreadsheet -- Enzyme Inhibition Constant Data from BindingDB
Found 2 hits for monomerid = 234686
TargetFatty acid-binding protein 5(Homo sapiens (Human))
Hoffmann-La Roche
US Patent
LigandPNGBDBM234686(US9353102, 6.3)
Affinity DataIC50:  227nMpH: 7.5Assay Description:Stock DMSO solutions (1.8 mM) of compounds were serially diluted 3-fold for ten concentrations with 100% DMSO (50 μM to 0.003 μM final comp...
Ligand InfoPC cidPC sid
In DepthDetails US Patent
TargetFatty acid-binding protein, adipocyte(Homo sapiens (Human))
Hoffmann-La Roche
US Patent
LigandPNGBDBM234686(US9353102, 6.3)
Affinity DataIC50:  105nMpH: 7.5Assay Description:Stock DMSO solutions (1.8 mM) of compounds were serially diluted 3-fold for ten concentrations with 100% DMSO (50 μM to 0.003 μM final comp...
Ligand InfoPC cidPC sid
In DepthDetails US Patent