BDBM234756 US9353104, 50
SMILES COc1ccc(nc1)[C@H]1C[C@@H]1COc1cc(NCc2ccc(C)nc2C)c(=O)n(C)n1
InChI Key InChIKey=IQQMNILXIXRJMP-MJGOQNOKSA-N
Data  1 KI
  Tab Delimited (TSV)   2D SDfile   Computed 3D by Vconf -m prep SDfile
Find this compound or compounds like it in BindingDB:
Activity Spreadsheet -- Enzyme Inhibition Constant Data from BindingDB
Found 1 hit for monomerid = 234756
LigandPNGBDBM234756(US9353104, 50)
Affinity DataKi:  0.00300nM. Assay description: The fluorescence polarization assay for cyclic nucleotide phosphodiesterases was performed using an IMAP® FP kit supplied by Molecular Devices, Sunny...
Ligand InfoPC cidPC sid
In DepthDetails US Patent