BDBM234763 US9353104, 57
SMILES Cc1ccc(CNc2cc(OC[C@H]3C[C@@H]3c3ccc4ccccc4n3)nn(C)c2=O)c(C)n1
InChI Key InChIKey=AYNYYOJTOMIPBM-RTWAWAEBSA-N
Data  1 KI
  Tab Delimited (TSV)   2D SDfile   Computed 3D by Vconf -m prep SDfile
Find this compound or compounds like it in BindingDB:
Activity Spreadsheet -- Enzyme Inhibition Constant Data from BindingDB
Found 1 hit for monomerid = 234763
LigandPNGBDBM234763(US9353104, 57)
Affinity DataKi:  0.00400nM. Assay description: The fluorescence polarization assay for cyclic nucleotide phosphodiesterases was performed using an IMAP® FP kit supplied by Molecular Devices, Sunny...
Ligand InfoPC cidPC sid
In DepthDetails US Patent