BDBM234898 US9556139, 201::sodium 6-chloro-7-(4-(4,5- dichloro-2- ethoxyphenethylcarbamoyl) phenoxy)chroman-4-carboxylate
SMILES CCOc1cc(Cl)c(Cl)cc1CCNC(=O)c1ccc(Oc2cc3OCCC(C(O)=O)c3cc2Cl)cc1
InChI Key InChIKey=AVOSEDZWSGOSGT-UHFFFAOYSA-N
Data  1 EC50
  Tab Delimited (TSV)   2D SDfile   Computed 3D by Vconf -m prep SDfile
Find this compound or compounds like it in BindingDB:
Activity Spreadsheet -- Enzyme Inhibition Constant Data from BindingDB
Found 1 hit for monomerid = 234898
TargetProstaglandin D2 receptor 2(Homo sapiens (Human))
Array Biopharma
US Patent
LigandPNGBDBM234898(US9556139, 201 | sodium 6-chloro-7-(4-(4,5- dichlo...)
Affinity DataEC50:  138nMpH: 7.4 T: 2°C. Assay description: The coding sequence of human DP2 was introduced into the human Leukemic cell line K562 by electroporation and stable clones expressing DP2 were obtai...
Ligand InfoPC cidPC sid
In DepthDetails US Patent