BDBM234939 US9556139, 238 Enantiomer 2
SMILES COc1cc(ccc1CCNC(=O)c1ccc(Oc2cc3OCC[C@@H](C(O)=O)c3cc2Cl)cc1)C(F)(F)F
InChI Key InChIKey=CUMLMZNTXLRULH-LJQANCHMSA-N
Data  1 EC50
  Tab Delimited (TSV)   2D SDfile   Computed 3D by Vconf -m prep SDfile
Find this compound or compounds like it in BindingDB:
Activity Spreadsheet -- Enzyme Inhibition Constant Data from BindingDB
Found 1 hit for monomerid = 234939
TargetProstaglandin D2 receptor 2(Homo sapiens (Human))
Array Biopharma
US Patent
LigandPNGBDBM234939(US9556139, 238 Enantiomer 2)
Affinity DataEC50:  16.2nMpH: 7.4 T: 2°C. Assay description: The coding sequence of human DP2 was introduced into the human Leukemic cell line K562 by electroporation and stable clones expressing DP2 were obtai...
Ligand InfoPC cidPC sid
In DepthDetails US Patent