BDBM235033 US9556168, 10C
SMILES OC(=O)c1ccc(-c2nn(Cc3c(Cl)cccc3C(F)(F)F)c3cc(cc(F)c23)C(=O)N2CCC2)c(F)c1
InChI Key InChIKey=HYEIELMRFQPSKL-UHFFFAOYSA-N
Data  1 IC50
  Tab Delimited (TSV)   2D SDfile   Computed 3D by Vconf -m prep SDfile
Find this compound or compounds like it in BindingDB:
Activity Spreadsheet -- Enzyme Inhibition Constant Data from BindingDB
Found 1 hit for monomerid = 235033
TargetNuclear receptor ROR-gamma(Homo sapiens (Human))
Merck Sharp & Dohme
US Patent
LigandPNGBDBM235033(US9556168, 10C)
Affinity DataIC50:  3nMpH: 7.0Assay Description:The compounds of the invention inhibit RORgammaT activity. Activation of RORgammaT activity can be measured using, e.g., biochemical TR-FRET assay. I...
Ligand InfoPC cidPC sid
In DepthDetails US Patent