BDBM23519 2-[3-(4-phenylphenyl)propanamido]benzoic acid::Biaryl Anthranilide Analogue, 1c::CHEMBL235741
SMILES OC(=O)c1ccccc1NC(=O)CCc1ccc(cc1)-c1ccccc1
InChI Key InChIKey=CAYOKBAXZPGNTO-UHFFFAOYSA-N
Data  2 IC50  2 EC50
  Tab Delimited (TSV)   2D SDfile   Computed 3D by Vconf -m prep SDfile
Find this compound or compounds like it in BindingDB:
Activity Spreadsheet -- Enzyme Inhibition Constant Data from BindingDB
Found 3 hits for monomerid = 23519
TargetHydroxycarboxylic acid receptor 2(Homo sapiens (Human))
Merck Research Laboratories
LigandPNGBDBM23519(2-[3-(4-phenylphenyl)propanamido]benzoic acid | Bi...)
Affinity DataIC50:  94nM EC50:  590nMpH: 7.4 T: 2°C. Assay description: Membranes were incubated in binding buffer with [5, 6-3H]-niacin in the presence of test compound. After 4 hours at room temperature, reactions were ...
In DepthDetails ArticlePubMed
TargetHydroxycarboxylic acid receptor 2(Homo sapiens (Human))
Merck Research Laboratories
LigandPNGBDBM23519(2-[3-(4-phenylphenyl)propanamido]benzoic acid | Bi...)
Affinity DataIC50:  290nM. Assay description: Displacement of [3H]-nicotinic acid from N-flag-tagged human HCA2 receptor expressed in HEK293T cell membranes by scintillation counting analysis
In DepthDetails ArticlePubMed
TargetHydroxycarboxylic acid receptor 2(Homo sapiens (Human))
Merck Research Laboratories
LigandPNGBDBM23519(2-[3-(4-phenylphenyl)propanamido]benzoic acid | Bi...)
Affinity DataEC50:  590nM. Assay description: Agonist activity at human GPR109A expressed in CHOK1 cells by [35S]GTPgammaS binding assay
In DepthDetails ArticlePubMed