BDBM235332 (3aR,5r,6aS)-5-benzyl-5- hydroxy-N-(2-meth- oxyphenyl)hexahydro- cyclopenta[c]pyrrole- 2(1H)-carboxamide::US10052306, 128
SMILES COc1ccccc1NC(=O)N1C[C@H]2C[C@](O)(Cc3ccccc3)C[C@H]2C1
InChI Key InChIKey=CWDRMSHDIFLXTP-OPMZPASUSA-N
Data  1 IC50
  Tab Delimited (TSV)   2D SDfile   Computed 3D by Vconf -m prep SDfile
Find this compound or compounds like it in BindingDB:
Activity Spreadsheet -- Enzyme Inhibition Constant Data from BindingDB
Found 1 hit for monomerid = 235332
TargetGlutamate receptor ionotropic, NMDA 2B(Homo sapiens (Human))
Cadent Therapeutics
US Patent
LigandPNGBDBM235332((3aR,5r,6aS)-5-benzyl-5- hydroxy-N-(2-meth- oxyphe...)
Affinity DataIC50:  1.00E+4nM. Assay description: To each well of the plate, 10 μL test compound, control (MK801) or HHnoCa buffer was added to a final concentration of 10 μM with a final c...
Ligand InfoPC cidPC sid
In DepthDetails US Patent