BDBM23555 3-Carboxamide-coumarin deriv., 31::N-(2-chlorophenyl)-6-methyl-2-oxo-2H-chromene-3-carboxamide
SMILES Cc1ccc2oc(=O)c(cc2c1)C(=O)Nc1ccccc1Cl
InChI Key InChIKey=FPUSGBFAZGKFJK-UHFFFAOYSA-N
Data  2 IC50
  Tab Delimited (TSV)   2D SDfile   Computed 3D by Vconf -m prep SDfile
Find this compound or compounds like it in BindingDB:
Activity Spreadsheet -- Enzyme Inhibition Constant Data from BindingDB
Found 5 hits for monomerid = 23555
TargetCoagulation factor XII(Homo sapiens (Human))
University Of Namur
LigandPNGBDBM23555(3-Carboxamide-coumarin deriv., 31 | N-(2-chlorophe...)
Affinity DataIC50:  3.00E+4nMpH: 7.9 T: 2°C. Assay description: After substrate hydrolysis reaction, the absorbance at 405 nm was measured in a microplate reader. Percentages of inhibition at each concentration we...
In DepthDetails ArticlePubMed
TargetProthrombin(Homo sapiens (Human))
University Of Namur
LigandPNGBDBM23555(3-Carboxamide-coumarin deriv., 31 | N-(2-chlorophe...)
Affinity DataIC50: >5.00E+4nM. Assay description:  After substrate hydrolysis reaction, the absorbance at 405 nm was measured in a microplate reader. Percentages of inhibition at each concentration w...
In DepthDetails ArticlePubMed
TargetCoagulation factor VII(Homo sapiens (Human))
University Of Namur
LigandPNGBDBM23555(3-Carboxamide-coumarin deriv., 31 | N-(2-chlorophe...)
Affinity Data. Assay description: After substrate hydrolysis reaction, the absorbance at 405 nm was measured in a microplate reader. Percentages of inhibition at each concentration we...
In DepthDetails ArticlePubMed
TargetPlasma kallikrein(Homo sapiens (Human))
University Of Namur
LigandPNGBDBM23555(3-Carboxamide-coumarin deriv., 31 | N-(2-chlorophe...)
Affinity Data. Assay description: After substrate hydrolysis reaction, the absorbance at 405 nm was measured in a microplate reader. Percentages of inhibition at each concentration we...
In DepthDetails ArticlePubMed
TargetCoagulation factor X(Homo sapiens (Human))
University Of Namur
LigandPNGBDBM23555(3-Carboxamide-coumarin deriv., 31 | N-(2-chlorophe...)
Affinity Data. Assay description: After substrate hydrolysis reaction, the absorbance at 405 nm was measured in a microplate reader. Percentages of inhibition at each concentration we...
In DepthDetails ArticlePubMed