BDBM235995 US9365562, 33
SMILES Cc1cnn(n1)-c1cc(nc(n1)C1CC1)N1CC(C1)c1nc2ccccc2n1C
InChI Key InChIKey=SETRSHIBWOZCAE-UHFFFAOYSA-N
Data  1 KI
  Tab Delimited (TSV)   2D SDfile   Computed 3D by Vconf -m prep SDfile
Find this compound or compounds like it in BindingDB:
Activity Spreadsheet -- Enzyme Inhibition Constant Data from BindingDB
Found 1 hit for monomerid = 235995
LigandPNGBDBM235995(US9365562, 33)
Affinity DataKi:  0.540nM ΔG°:  -12.6kcal/molepH: 7.2 T: 2°C. Assay description: The fluorescence polarization assay for cyclic nucleotide phosphodiesterases was performed using an IMAP® FP kit supplied by Molecular Devices, S...
Ligand InfoPC cidPC sid
In DepthDetails US Patent