BDBM23633 2-{[4,8-bis(azonan-1-yl)-6-[bis(2-hydroxyethyl)amino]pyrimido[5,4-d][1,3]diazin-2-yl](2-hydroxyethyl)amino}ethan-1-ol::Dipyridamole Analogue, 15
SMILES OCCN(CCO)c1nc(N2CCCCCCCC2)c2nc(nc(N3CCCCCCCC3)c2n1)N(CCO)CCO
InChI Key InChIKey=HJLHXGREQMSOOT-UHFFFAOYSA-N
Data  1 KI  1 IC50
  Tab Delimited (TSV)   2D SDfile   Computed 3D by Vconf -m prep SDfile
Find this compound or compounds like it in BindingDB:
Activity Spreadsheet -- Enzyme Inhibition Constant Data from BindingDB
Found 1 hit for monomerid = 23633
TargetEquilibrative nucleoside transporter 1(Homo sapiens (Human))
University Of Tennessee Health Science Center
LigandPNGBDBM23633(2-{[4,8-bis(azonan-1-yl)-6-[bis(2-hydroxyethyl)ami...)
Affinity DataKi:  0.770nM ΔG°:  -12.3kcal/mole IC50:  13.6nMpH: 7.4 T: 2°C. Assay description: The compounds were tested to determine their ENT1 nucleoside transporter binding ability by a flow cytometric assay using human leukemia K562 cells i...
In DepthDetails ArticlePubMed