BDBM236538 2-Methylthio-10-(2-N,N-dimethylaminoethyl)isoindolo[2,1-a]indole (29)
SMILES CSc1ccc2C3Cc4ccccc4C3=C(CCN(C)C)c2c1
InChI Key InChIKey=DPVVIOAVPGLFMS-UHFFFAOYSA-N
Data  1 KI
  Tab Delimited (TSV)   2D SDfile   Computed 3D by Vconf -m prep SDfile
Find this compound or compounds like it in BindingDB:
Activity Spreadsheet -- Enzyme Inhibition Constant Data from BindingDB
Found 1 hit for monomerid = 236538
Target5-hydroxytryptamine receptor 6(Homo sapiens (Human))
Suven Life Sciences
LigandPNGBDBM236538(2-Methylthio-10-(2-N,N-dimethylaminoethyl)isoindol...)
Affinity DataKi:  49.7nM ΔG°:  -10.4kcal/molepH: 7.4 T: 2°C. Assay description: In brief, receptor source and radioligand used were human recombinant expressed in HEK-293 cells and [3H] LSD (60-80 Ci/mmol), respectively. The fina...
Ligand InfoPC cidPC sid
In DepthDetails ArticlePubMed