BDBM236854 US9388162, 42
SMILES CCS(=O)(=O)N[C@H]1C[C@@]2(O)[C@H]3Cc4ccc(O)cc4[C@@]2(CCN3CC2CC2)CC1=O
InChI Key InChIKey=BATFHKHFCSQUFU-BDKRGJGYSA-N
Data  1 EC50
  Tab Delimited (TSV)   2D SDfile   Computed 3D by Vconf -m prep SDfile
Find this compound or compounds like it in BindingDB:
Activity Spreadsheet -- Enzyme Inhibition Constant Data from BindingDB
Found 1 hit for monomerid = 236854
TargetMu-type opioid receptor(Homo sapiens (Human))
Purdue Pharma
US Patent
LigandPNGBDBM236854(US9388162, 42)
Affinity DataEC50: >2.00E+5nMpH: 7.4 T: 2°C. Assay description: [35S]GTPγS functional assays were conducted using freshly thawed μ-receptor membranes prepared from a cell line expressing recombinant μ ...
Ligand InfoPC cidPC sid
In DepthDetails US Patent