BDBM237087 US9388198, 13
SMILES Clc1ccc(cn1)C1(CNC(=O)C2CCCc3ncsc23)CCCCC1
InChI Key InChIKey=UULLWSUBJVMANU-UHFFFAOYSA-N
Data  1 IC50
  Tab Delimited (TSV)   2D SDfile   Computed 3D by Vconf -m prep SDfile
Find this compound or compounds like it in BindingDB:
Activity Spreadsheet -- Enzyme Inhibition Constant Data from BindingDB
Found 1 hit for monomerid = 237087
TargetP2X purinoceptor 7(Homo sapiens (Human))
Actelion Pharmaceuticals
US Patent
LigandPNGBDBM237087(US9388198, 13)
Affinity DataIC50:  3.40nMT: 2°C. Assay description: Cells were grown to confluency in adherent culture at 37° C. in a humidified 5% CO2 incubator (split 1/5 every 3-4 days with DMEM, 10% FCS, 1% Pe...
Ligand InfoPC cidPC sid
In DepthDetails US Patent