BDBM237161 US9402878, II
SMILES CC[C@H](C)[C@H](NC(=O)[C@@H](Cc1ccccc1)NC)C(=O)N[C@@H](CO)C(=O)N[C@H](CCC(N)=O)C(=O)N[C@H]([C@@H](C)CC)C(=O)N[C@@H]([C@@H](C)CC)C(=O)N[C@@H](CO)C(=O)N[C@@H]1[C@H](C)OC(=O)[C@@H](NC(=O)[C@H](C[C@H]2CNC(=N)N2)NC(=O)[C@H](C)NC1=O)[C@@H](C)CC
InChI Key InChIKey=LMBFAGIMSUYTBN-MPZNNTNKSA-N
Data  1 IC50
  Tab Delimited (TSV)   2D SDfile   Computed 3D by Vconf -m prep SDfile
Find this compound or compounds like it in BindingDB:
Activity Spreadsheet -- Enzyme Inhibition Constant Data from BindingDB
Found 1 hit for monomerid = 237161
TargetPotassium voltage-gated channel subfamily H member 2(Homo sapiens (Human))
Novobiotic Pharmaceuticals
US Patent
LigandPNGBDBM237161(US9402878, II)
Affinity DataIC50: >1.00E+5nMpH: 7.0Assay Description:Briefly, the experiments were performed on an IonWorks™ HT instrument (Molecular Devices Corporation), which automatically performs electrophys...
Ligand InfoPC cidPC sid
In DepthDetails US Patent