BDBM237211 1-(4-Hydroxy-3-methoxybenzyl)-1-(4-methoxyphenyl)-3-phenylurea (3a)
SMILES COc1ccc(cc1)N(Cc1ccc(O)c(OC)c1)C(=O)Nc1ccccc1
InChI Key InChIKey=GZLINIMLCMRJJW-UHFFFAOYSA-N
Data  1 IC50
  Tab Delimited (TSV)   2D SDfile   Computed 3D by Vconf -m prep SDfile
Find this compound or compounds like it in BindingDB:
Activity Spreadsheet -- Enzyme Inhibition Constant Data from BindingDB
Found 1 hit for monomerid = 237211
TargetMitogen-activated protein kinase 1/3(Homo sapiens (Human))
Nanjing University
LigandPNGBDBM237211(1-(4-Hydroxy-3-methoxybenzyl)-1-(4-methoxyphenyl)-...)
Affinity DataIC50:  5.76E+3nM. Assay description: Detection of the effect of compounds on p-MEK1/2, t-ERK1/2, pERK1/2, p-Rsk1 and p-Elk-1 activity in B16-F10 cells was performed using ELISA kits (Inv...
Ligand InfoPC cidPC sid
In DepthDetails ArticlePubMed