BDBM237227 1-(2-Chlorophenyl)-1-(4-hydroxy-3-methoxybenzyl)-3-phenylthiourea (8b)
SMILES COc1cc(CN(C(=S)Nc2ccccc2)c2ccccc2Cl)ccc1O
InChI Key InChIKey=OLCXMFWIUKXNPN-UHFFFAOYSA-N
Data  1 IC50
  Tab Delimited (TSV)   2D SDfile   Computed 3D by Vconf -m prep SDfile
Find this compound or compounds like it in BindingDB:
Activity Spreadsheet -- Enzyme Inhibition Constant Data from BindingDB
Found 1 hit for monomerid = 237227
TargetMitogen-activated protein kinase 1/3(Homo sapiens (Human))
Nanjing University
LigandPNGBDBM237227(1-(2-Chlorophenyl)-1-(4-hydroxy-3-methoxybenzyl)-3...)
Affinity DataIC50:  6.99E+3nM. Assay description: Detection of the effect of compounds on p-MEK1/2, t-ERK1/2, pERK1/2, p-Rsk1 and p-Elk-1 activity in B16-F10 cells was performed using ELISA kits (Inv...
Ligand InfoPC cidPC sid
In DepthDetails ArticlePubMed