BDBM237765 US9394282, 5-44
SMILES CCOC(=O)N1CC[C@@H]([C@@H](C1)C#N)n1cc(C(N)=O)c(Nc2ccc(F)cc2)n1
InChI Key InChIKey=YRTSSFWBUWVSHC-WBMJQRKESA-N
Data  2 IC50
  Tab Delimited (TSV)   2D SDfile   Computed 3D by Vconf -m prep SDfile
Find this compound or compounds like it in BindingDB:
Activity Spreadsheet -- Enzyme Inhibition Constant Data from BindingDB
Found 2 hits for monomerid = 237765
TargetTyrosine-protein kinase JAK2(Homo sapiens (Human))
Merck Sharp & Dohme
US Patent
LigandPNGBDBM237765(US9394282, 5-44)
Affinity DataIC50:  1.20E+3nM. Assay description: The ability of compounds to inhibit the activity of JAK1, JAK2, JAK3, and Tyk2 was measured using a recombinant purified GST-tagged catalytic domain ...
Ligand InfoPC cidPC sid
In DepthDetails US Patent
TargetTyrosine-protein kinase JAK1(Homo sapiens (Human))
Merck Sharp & Dohme
US Patent
LigandPNGBDBM237765(US9394282, 5-44)
Affinity DataIC50:  200nM. Assay description: The ability of compounds to inhibit the activity of JAK1, JAK2, JAK3, and Tyk2 was measured using a recombinant purified GST-tagged catalytic domain ...
Ligand InfoPC cidPC sid
In DepthDetails US Patent