BDBM238394 US9394297, 22
SMILES CCC1CNC(=O)c2cc([nH]c12)-c1cccc2ccc(Cl)nc12
InChI Key
Data  2 IC50
  Tab Delimited (TSV)   2D SDfile   Computed 3D by Vconf -m prep SDfile
Find this compound or compounds like it in BindingDB:
Activity Spreadsheet -- Enzyme Inhibition Constant Data from BindingDB
Found 2 hits for monomerid = 238394
TargetSerine/threonine-protein kinase pim-1(Homo sapiens (Human))
Amgen
US Patent
LigandPNGBDBM238394(US9394297, 22)
Affinity DataIC50:  60.9nMpH: 7.0 T: 2°C. Assay description: The assay for the determination of Pim activity is based on the formation of phosphorylated biotinylated-BAD peptide at the Serine 112 residue (S112)...
Ligand InfoPC cidPC sid
In DepthDetails US Patent
TargetSerine/threonine-protein kinase pim-2(Homo sapiens (Human))
Amgen
US Patent
LigandPNGBDBM238394(US9394297, 22)
Affinity DataIC50:  248nMpH: 7.0 T: 2°C. Assay description: The assay for the determination of Pim activity is based on the formation of phosphorylated biotinylated-BAD peptide at the Serine 112 residue (S112)...
Ligand InfoPC cidPC sid
In DepthDetails US Patent