BDBM2390 US8507533, 146
SMILES OC(=O)CCNC(=O)c1ccc(cc1)[C@@H](Nc1ccc(nc1)-n1cc(cn1)C(F)(F)F)C1CCCCC1
InChI Key InChIKey=BUHOCUGQWONNJV-DEOSSOPVSA-N
Data  1 KI
  Tab Delimited (TSV)   2D SDfile   Computed 3D by Vconf -m prep SDfile
Find this compound or compounds like it in BindingDB:
Activity Spreadsheet -- Enzyme Inhibition Constant Data from BindingDB
Found 1 hit for monomerid = 2390
TargetPro-glucagon(Homo sapiens (Human))
Pfizer
US Patent
LigandPNGBDBM2390(US8507533, 146)
Affinity DataKi:  9.05nM. Assay description: The Glucagon SPA assay is used to determine the ability of test compounds to block the binding of glucagon-cex to the glucagon receptors.
In DepthDetails US Patent