BDBM239164 4-Cyanobenzoic acid (3)
SMILES OC(=O)c1ccc(cc1)C#N
InChI Key InChIKey=ADCUEPOHPCPMCE-UHFFFAOYSA-N
Data  3 KI
  Tab Delimited (TSV)   2D SDfile   Computed 3D by Vconf -m prep SDfile
Find this compound or compounds like it in BindingDB:
Activity Spreadsheet -- Enzyme Inhibition Constant Data from BindingDB
Found 3 hits for monomerid = 239164
TargetSiderophore-binding protein(Mycobacterium tuberculosis)
Universit?? Degli Studi Di Firenze
LigandPNGBDBM239164(4-Cyanobenzoic acid (3))
Affinity DataKi:  190nM ΔG°:  -9.16kcal/molepH: 7.5 T: 2°C. Assay description: An Applied Photophysics stopped-flow instrument has been used for assaying the CA-catalyzed CO2 hydration activity [Khalifah et al., J. Biol. Chem., ...
In DepthDetails ArticlePubMed
TargetCarbonic anhydrase 2(Mycobacterium tuberculosis)
Universit?? Degli Studi Di Firenze
LigandPNGBDBM239164(4-Cyanobenzoic acid (3))
Affinity DataKi:  2.12E+3nM ΔG°:  -7.73kcal/molepH: 7.5 T: 2°C. Assay description: An Applied Photophysics stopped-flow instrument has been used for assaying the CA-catalyzed CO2 hydration activity [Khalifah et al., J. Biol. Chem., ...
In DepthDetails ArticlePubMed
TargetBeta-carbonic anhydrase 1(Mycobacterium tuberculosis)
Universit?? Degli Studi Di Firenze
LigandPNGBDBM239164(4-Cyanobenzoic acid (3))
Affinity DataKi:  6.20E+3nM ΔG°:  -7.10kcal/molepH: 7.5 T: 2°C. Assay description: An Applied Photophysics stopped-flow instrument has been used for assaying the CA-catalyzed CO2 hydration activity [Khalifah et al., J. Biol. Chem., ...
In DepthDetails ArticlePubMed