BDBM239259 US9416126, E2
SMILES COc1ccc2[nH]nc(-c3cc(ncn3)N3C[C@H](F)[C@@H](F)C3)c2c1
InChI Key
Data  1 IC50
  Tab Delimited (TSV)   2D SDfile   Computed 3D by Vconf -m prep SDfile
Find this compound or compounds like it in BindingDB:
Activity Spreadsheet -- Enzyme Inhibition Constant Data from BindingDB
Found 1 hit for monomerid = 239259
TargetLeucine-rich repeat serine/threonine-protein kinase 2 [970-2527](Homo sapiens (Human))
Merck Sharp & Dohme
US Patent
LigandPNGBDBM239259(US9416126, E2)
Affinity DataIC50:  68.6nMpH: 8.5 T: 2°C. Assay description: a) 400 nl of a 1:2.15 serial dilution of test compound(98 μM top assay concentration) is spotted via Labcyte Echo to certain wells in a 384 well...
Ligand InfoPC cidPC sid
In DepthDetails US Patent