BDBM239414 US9416126, M24
SMILES Cn1cc(cn1)-c1ccc2[nH]nc(-c3cc(ncn3)N3CCC(F)(CO)CC3)c2c1
InChI Key InChIKey=OGINRGVNFYNVIN-UHFFFAOYSA-N
Data  1 IC50
  Tab Delimited (TSV)   2D SDfile   Computed 3D by Vconf -m prep SDfile
Find this compound or compounds like it in BindingDB:
Activity Spreadsheet -- Enzyme Inhibition Constant Data from BindingDB
Found 1 hit for monomerid = 239414
TargetLeucine-rich repeat serine/threonine-protein kinase 2 [970-2527](Homo sapiens (Human))
Merck Sharp & Dohme
US Patent
LigandPNGBDBM239414(US9416126, M24)
Affinity DataIC50:  2.90nMpH: 8.5 T: 2°C. Assay description: a) 400 nl of a 1:2.15 serial dilution of test compound(98 μM top assay concentration) is spotted via Labcyte Echo to certain wells in a 384 well...
Ligand InfoPC cidPC sid
In DepthDetails US Patent