BDBM23967 5-(4-phenylbenzyl)oxazole-4-carboxamide, 6n::5-{[4-(3-acetamidophenyl)phenyl]methyl}-N-phenyl-1,3-oxazole-4-carboxamide
SMILES CC(=O)Nc1cccc(c1)-c1ccc(Cc2ocnc2C(=O)Nc2ccccc2)cc1
InChI Key InChIKey=OGYYLECFXZOXKB-UHFFFAOYSA-N
Data  1 IC50  1 EC50
  Tab Delimited (TSV)   2D SDfile   Computed 3D by Vconf -m prep SDfile
Find this compound or compounds like it in BindingDB:
Activity Spreadsheet -- Enzyme Inhibition Constant Data from BindingDB
Found 1 hit for monomerid = 23967
TargetProstacyclin receptor(Homo sapiens (Human))
Pharmacopeia Drug Discovery
LigandPNGBDBM23967(5-(4-phenylbenzyl)oxazole-4-carboxamide, 6n | 5-{[...)
Affinity DataIC50:  3.48E+3nM EC50:  828nMpH: 7.4 T: 2°C. Assay description: IP receptor binding activity was quantified via a filter binding assay measuring displacement of [3H]-Iloprost binding to human platelet membranes. R...
In DepthDetails ArticlePubMed