BDBM239701 US9394309, 158
SMILES Cc1ccc(NC(=O)c2cccc(c2)S(F)(F)(F)(F)F)cc1-n1ccn2nc(c(F)c12)-c1cccnc1
InChI Key InChIKey=KSSNJDUSNSZQPY-UHFFFAOYSA-N
Data  1 IC50
  Tab Delimited (TSV)   2D SDfile   Computed 3D by Vconf -m prep SDfile
Find this compound or compounds like it in BindingDB:
Activity Spreadsheet -- Enzyme Inhibition Constant Data from BindingDB
Found 1 hit for monomerid = 239701
TargetAngiopoietin-1 receptor [776-1124](Homo sapiens (Human))
Bayer Pharma Aktiengesellschaft
US Patent
LigandPNGBDBM239701(US9394309, 158)
Affinity DataIC50:  58nMpH: 7.0 T: 2°C. Assay description: For the assay, 50 nl of a 100-fold concentrated solution of the respective test substance in DMSO were pipetted into a black low-volume 384-well micr...
Ligand InfoPC cidPC sid
In DepthDetails US Patent