BDBM23986 3,4-dihydro-1H-2-benzothiopyran-3-one::isothiochromanone, 4b
SMILES O=C1Cc2ccccc2CS1
InChI Key InChIKey=LVTCUEJYCFOIFM-UHFFFAOYSA-N
Data  1 KI  3 IC50
  Tab Delimited (TSV)   2D SDfile   Computed 3D by Vconf -m prep SDfile
Find this compound or compounds like it in BindingDB:
Activity Spreadsheet -- Enzyme Inhibition Constant Data from BindingDB
Found 4 hits for monomerid = 23986
TargetBacterial leucyl aminopeptidase(Vibrio proteolyticus)
Enscmu
LigandPNGBDBM23986(3,4-dihydro-1H-2-benzothiopyran-3-one | isothiochr...)
Affinity DataKi:  4.00E+3nM. Assay description: Spectrophotometric assays were performed by monitoring hydrolysis of chromogenic substrate. The release of para-nitroaniline at 405 nm was measured t...
In DepthDetails ArticlePubMed
TargetLeukotriene A-4 hydrolase(Homo sapiens (Human))
Enscmu
LigandPNGBDBM23986(3,4-dihydro-1H-2-benzothiopyran-3-one | isothiochr...)
Affinity DataIC50: >1.00E+6nM. Assay description: Spectrophotometric assays were performed by monitoring hydrolysis of chromogenic substrate. The release of para-nitroaniline at 405 nm was measured t...
In DepthDetails ArticlePubMed
TargetAminopeptidase N(Sus scrofa (Pig))
Enscmu
LigandPNGBDBM23986(3,4-dihydro-1H-2-benzothiopyran-3-one | isothiochr...)
Affinity DataIC50: >1.00E+6nM. Assay description: Spectrophotometric assays were performed by monitoring hydrolysis of chromogenic substrate. The release of para-nitroaniline at 405 nm was measured t...
In DepthDetails ArticlePubMed
TargetCytosol aminopeptidase(Bos taurus (bovine))
Enscmu
LigandPNGBDBM23986(3,4-dihydro-1H-2-benzothiopyran-3-one | isothiochr...)
Affinity DataIC50: >1.00E+6nMpH: 8.0 T: 2°C. Assay description: Spectrophotometric assays were performed by monitoring hydrolysis of chromogenic substrate. The release of para-nitroaniline at 405 nm was measured t...
In DepthDetails ArticlePubMed