BDBM23996 5-ethyl-5'-phenyl-1,2-dihydro-3'H-spiro[indole-3,2'-[1,3,4]thiadiazole]-2-one::thiadiazole derivative, 11
SMILES CCc1ccc2NC(=O)C3(NN=C(S3)c3ccccc3)c2c1
InChI Key InChIKey=ICJWVAKZQXYHBB-UHFFFAOYSA-N
Data  1 IC50
  Tab Delimited (TSV)   2D SDfile   Computed 3D by Vconf -m prep SDfile
Find this compound or compounds like it in BindingDB:
Activity Spreadsheet -- Enzyme Inhibition Constant Data from BindingDB
Found 1 hit for monomerid = 23996
LigandPNGBDBM23996(5-ethyl-5'-phenyl-1,2-dihydro-3'H-spiro[indole-3,2...)
Affinity DataIC50:  9.60E+3nMpH: 7.5 T: 2°C. Assay description: ADAMTS-5 activity was determined using a fluorescence resonance energy transfer (FRET) assay using a QF peptide containing an aggrecanase cleavage si...
In DepthDetails ArticlePubMed