BDBM24017 1-methyl-5'-(4-methylphenyl)-1,2-dihydro-3'H-spiro[indole-3,2'-[1,3,4]thiadiazole]-2-one::thiadiazole derivative, 29
SMILES CN1C(=O)C2(NN=C(S2)c2ccc(C)cc2)c2ccccc12
InChI Key InChIKey=LJSSOYOUTKPEIR-UHFFFAOYSA-N
Data  1 IC50
  Tab Delimited (TSV)   2D SDfile   Computed 3D by Vconf -m prep SDfile
Find this compound or compounds like it in BindingDB:
Activity Spreadsheet -- Enzyme Inhibition Constant Data from BindingDB
Found 1 hit for monomerid = 24017
LigandPNGBDBM24017(1-methyl-5'-(4-methylphenyl)-1,2-dihydro-3'H-spiro...)
Affinity DataIC50:  4.60E+3nM. Assay description: ADAMTS-5 activity was determined using a fluorescence resonance energy transfer (FRET) assay using a QF peptide containing an aggrecanase cleavage si...
In DepthDetails ArticlePubMed