BDBM240657 US9409924, 34
SMILES CNC1=N[C@H]2[C@H](O[C@H]([C@H](C)O)[C@@H](O)[C@H]2F)S1
InChI Key InChIKey=DYOCXHLLDLBZHU-ANBNMOMCSA-N
Data  1 KI  1 EC50
  Tab Delimited (TSV)   2D SDfile   Computed 3D by Vconf -m prep SDfile
Find this compound or compounds like it in BindingDB:
Activity Spreadsheet -- Enzyme Inhibition Constant Data from BindingDB
Found 2 hits for monomerid = 240657
TargetProtein O-GlcNAcase(Homo sapiens (Human))
Alectos Therapeutics
US Patent
LigandPNGBDBM240657(US9409924, 34)
Affinity DataKi:  0.300nM ΔG°:  -13.0kcal/molepH: 7.0 T: 2°C. Assay description: Enzymatic reactions were carried out in a reaction containing 50 mM NaH2PO4, 100 mM NaCl and 0.1% BSA (pH 7.0) using 2 mM 4-Methylumbelliferyl N-acet...
Ligand InfoPC cidPC sid
In DepthDetails US Patent
TargetProtein O-GlcNAcase(Homo sapiens (Human))
Alectos Therapeutics
US Patent
LigandPNGBDBM240657(US9409924, 34)
Affinity DataEC50:  5.20nM. Assay description: Inhibition of O-GlcNAcase, which removes O-GlcNAc from cellular proteins, results in an increase in the level of O-GlcNAcylated protein in cells. An ...
Ligand InfoPC cidPC sid
In DepthDetails US Patent