BDBM241012 US9409892, 107
SMILES OC(=O)C[C@@H](CCc1ccccc1)NC(=O)c1nc(C#N)c2cc(Oc3ccccc3)ccc2c1O
InChI Key InChIKey=WZJDYOWVFHSRTF-LJQANCHMSA-N
Data  2 IC50
  Tab Delimited (TSV)   2D SDfile   Computed 3D by Vconf -m prep SDfile
Find this compound or compounds like it in BindingDB:
Activity Spreadsheet -- Enzyme Inhibition Constant Data from BindingDB
Found 2 hits for monomerid = 241012
TargetEgl nine homolog 1(Homo sapiens (Human))
Fibrogen
US Patent
LigandPNGBDBM241012(US9409892, 107)
Affinity DataIC50:  1.18E+4nMpH: 7.4Assay Description:Ketoglutaric acid α-[1-14C]-sodium salt, alpha-ketoglutaric acid sodium salt, and HPLC purified peptide may be obtained from commercial sources...
Ligand InfoPC cidPC sid
In DepthDetails US Patent
TargetProlyl hydroxylase EGLN2(Homo sapiens (Human))
Fibrogen
US Patent
LigandPNGBDBM241012(US9409892, 107)
Affinity DataIC50:  2.37E+3nMpH: 7.4Assay Description:Ketoglutaric acid α-[1-14C]-sodium salt, alpha-ketoglutaric acid sodium salt, and HPLC purified peptide may be obtained from commercial sources...
Ligand InfoPC cidPC sid
In DepthDetails US Patent