BDBM241713 US9409917, 10
SMILES OC1(CNC(=O)C2CCOc3ncccc23)CCCCC1
InChI Key InChIKey=QMNHSDVRJFYAOM-UHFFFAOYSA-N
Data  1 IC50
  Tab Delimited (TSV)   2D SDfile   Computed 3D by Vconf -m prep SDfile
Find this compound or compounds like it in BindingDB:
Activity Spreadsheet -- Enzyme Inhibition Constant Data from BindingDB
Found 1 hit for monomerid = 241713
TargetP2X purinoceptor 7(Homo sapiens (Human))
Actelion Pharmaceuticals
US Patent
LigandPNGBDBM241713(US9409917, 10)
Affinity DataIC50:  3.18E+3nMT: 2°C. Assay description: HEK cells stably expressing P2X7 were used to screen drugs using the YO-PRO1 assay. Cells were grown to confluency in adherent culture at 37° C. ...
Ligand InfoPC cidPC sid
In DepthDetails US Patent