BDBM241715 US9409917, 12
SMILES Cc1cc(Cl)cc(Cl)c1CNC(=O)C1(F)CCOc2ncccc12
InChI Key InChIKey=HXBZTCDIUICWPT-UHFFFAOYSA-N
Data  1 IC50
  Tab Delimited (TSV)   2D SDfile   Computed 3D by Vconf -m prep SDfile
Find this compound or compounds like it in BindingDB:
Activity Spreadsheet -- Enzyme Inhibition Constant Data from BindingDB
Found 1 hit for monomerid = 241715
TargetP2X purinoceptor 7(Homo sapiens (Human))
Actelion Pharmaceuticals
US Patent
LigandPNGBDBM241715(US9409917, 12)
Affinity DataIC50:  3.10nMT: 2°C. Assay description: HEK cells stably expressing P2X7 were used to screen drugs using the YO-PRO1 assay. Cells were grown to confluency in adherent culture at 37° C. ...
Ligand InfoPC cidPC sid
In DepthDetails US Patent