BDBM242030 US9415055, 2,3-dichloro-N-[2-morpholino-2-[2-(trifluoromethyl)pyrimidin-5-yl]ethyl]benzamide::US9593105, 36
SMILES FC(F)(F)c1ncc(cn1)C(CNC(=O)c1cccc(Cl)c1Cl)N1CCOCC1
InChI Key InChIKey=AZBWLFIJIDNOJD-UHFFFAOYSA-N
Data  4 IC50
  Tab Delimited (TSV)   2D SDfile   Computed 3D by Vconf -m prep SDfile
Find this compound or compounds like it in BindingDB:
Activity Spreadsheet -- Enzyme Inhibition Constant Data from BindingDB
Found 4 hits for monomerid = 242030
TargetP2X purinoceptor 7(Homo sapiens (Human))
H. Lundbeck
US Patent
LigandPNGBDBM242030(US9415055, 2,3-dichloro-N-[2-morpholino-2-[2-(trif...)
Affinity DataIC50:  8.20nMpH: 7.4 T: 2°C. Assay description: Briefly, 293-human or mouse P2X7 stable cells were incubated in sucrose buffer, pH 7.4 [KCl (5 mM), NaH2PO42H2O (9.6 mM), HEPES (25 mM), sucrose (280...
Ligand InfoPC cidPC sid
In DepthDetails US Patent
TargetP2X purinoceptor 7(Homo sapiens (Human))
H. Lundbeck
US Patent
LigandPNGBDBM242030(US9415055, 2,3-dichloro-N-[2-morpholino-2-[2-(trif...)
Affinity DataIC50:  4.80nM. Assay description: Cell culture: 293 HEK cells, stably transfected with plasmids capable of expressing human P2X7 receptor, were cultured by standard methods. Cells wer...
Ligand InfoPC cidPC sid
In DepthDetails US Patent
TargetP2X purinoceptor 7(Homo sapiens (Human))
H. Lundbeck
US Patent
LigandPNGBDBM242030(US9415055, 2,3-dichloro-N-[2-morpholino-2-[2-(trif...)
Affinity DataIC50:  3.20nM. Assay description: Cell culture: 293 HEK cells, stably transfected with plasmids capable of expressing human P2X7 receptor, were cultured by standard methods. Cells wer...
Ligand InfoPC cidPC sid
In DepthDetails US Patent
TargetP2X purinoceptor 7(Homo sapiens (Human))
H. Lundbeck
US Patent
LigandPNGBDBM242030(US9415055, 2,3-dichloro-N-[2-morpholino-2-[2-(trif...)
Affinity DataIC50:  8.20nM. Assay description: Cell culture: 293 HEK cells, stably transfected with plasmids capable of expressing human P2X7 receptor, were cultured by standard methods. Cells wer...
Ligand InfoPC cidPC sid
In DepthDetails US Patent