BDBM242044 US9415055, 2-chloro-N-[2-(4,4-difluoro-1-piperidyl)-2-[6-(trifluoromethyl)-3-pyridyl]ethyl]benzamide::US9593105, 45
SMILES FC(F)(F)c1ccc(cn1)C(CNC(=O)c1ccccc1Cl)N1CCC(F)(F)CC1
InChI Key InChIKey=DKPFRKQJBIIBNK-UHFFFAOYSA-N
Data  2 IC50
  Tab Delimited (TSV)   2D SDfile   Computed 3D by Vconf -m prep SDfile
Find this compound or compounds like it in BindingDB:
Activity Spreadsheet -- Enzyme Inhibition Constant Data from BindingDB
Found 2 hits for monomerid = 242044
TargetP2X purinoceptor 7(Homo sapiens (Human))
H. Lundbeck
US Patent
LigandPNGBDBM242044(US9415055, 2-chloro-N-[2-(4,4-difluoro-1-piperidyl...)
Affinity DataIC50:  1.80nM. Assay description: Cell culture: 293 HEK cells, stably transfected with plasmids capable of expressing human P2X7 receptor, were cultured by standard methods. Cells wer...
Ligand InfoPC cidPC sid
In DepthDetails US Patent
TargetP2X purinoceptor 7(Homo sapiens (Human))
H. Lundbeck
US Patent
LigandPNGBDBM242044(US9415055, 2-chloro-N-[2-(4,4-difluoro-1-piperidyl...)
Affinity DataIC50:  1.80nMpH: 7.4 T: 2°C. Assay description: Briefly, 293-human or mouse P2X7 stable cells were incubated in sucrose buffer, pH 7.4 [KCl (5 mM), NaH2PO42H2O (9.6 mM), HEPES (25 mM), sucrose (280...
Ligand InfoPC cidPC sid
In DepthDetails US Patent