BDBM242081 US9415055, (-)2-chloro-N-[2-(4,4-difluoro-1-piperidyl)-2-[6-(trifluoromethyl)-3-pyridyl]ethyl]-6-fluoro-benzamide
SMILES Fc1cccc(Cl)c1C(=O)NCC(N1CCC(F)(F)CC1)c1ccc(nc1)C(F)(F)F
InChI Key InChIKey=QEBIAIICJUDQPI-UHFFFAOYSA-N
Data  1 IC50
  Tab Delimited (TSV)   2D SDfile   Computed 3D by Vconf -m prep SDfile
Find this compound or compounds like it in BindingDB:
Activity Spreadsheet -- Enzyme Inhibition Constant Data from BindingDB
Found 1 hit for monomerid = 242081
TargetP2X purinoceptor 7(Homo sapiens (Human))
H. Lundbeck
US Patent
LigandPNGBDBM242081(US9415055, (-)2-chloro-N-[2-(4,4-difluoro-1-piperi...)
Affinity DataIC50:  3nMpH: 7.4 T: 2°C. Assay description: Briefly, 293-human or mouse P2X7 stable cells were incubated in sucrose buffer, pH 7.4 [KCl (5 mM), NaH2PO42H2O (9.6 mM), HEPES (25 mM), sucrose (280...
Ligand InfoPC cidPC sid
In DepthDetails US Patent