BDBM242289 US9416129, 67
SMILES CN1C(=N)N[C@@](C)(CS1(=O)=O)c1sc(cc1Cl)-c1ccc(cc1)-n1nccn1
InChI Key InChIKey=HNYOADSNRQLYMD-KRWDZBQOSA-N
Data  2 KI
  Tab Delimited (TSV)   2D SDfile   Computed 3D by Vconf -m prep SDfile
Find this compound or compounds like it in BindingDB:
Activity Spreadsheet -- Enzyme Inhibition Constant Data from BindingDB
Found 2 hits for monomerid = 242289
TargetBeta-secretase 2(Homo sapiens (Human))
Merck Sharp & Dohme
US Patent
LigandPNGBDBM242289(US9416129, 67)
Affinity DataKi:  555nM ΔG°:  -8.67kcal/molepH: 5.0 T: 2°C. Assay description: Inhibitor compounds, prepared at 3× the desired final concentration in 1×BACE assay buffer (20 mM sodium acetate pH 5.0, 10% glycerol, 0....
Ligand InfoPC cidPC sid
In DepthDetails US Patent
TargetBeta-secretase 1(Homo sapiens (Human))
Merck Sharp & Dohme
US Patent
LigandPNGBDBM242289(US9416129, 67)
Affinity DataKi:  2.27E+3nM ΔG°:  -7.82kcal/molepH: 5.0 T: 2°C. Assay description: Varying concentrations of inhibitors at 3× the final desired concentration in a volume of 10 μl are preincubated with purified human BACE1 c...
Ligand InfoPC cidPC sid
In DepthDetails US Patent