BDBM242365 US10047093, 8-22::US10392392, Example 8-22::US10875864, EX. 8-22::US9416132, 8-22
SMILES CN1CCC(O)(CNc2ccc3ncc(-c4cccc(OC(F)(F)F)c4)n3n2)CC1
InChI Key InChIKey=QQFUESRSGGYZDE-UHFFFAOYSA-N
Data  4 IC50
  Tab Delimited (TSV)   2D SDfile   Computed 3D by Vconf -m prep SDfile
Find this compound or compounds like it in BindingDB:
Activity Spreadsheet -- Enzyme Inhibition Constant Data from BindingDB
Found 4 hits for monomerid = 242365
TargetSerine/threonine-protein kinase pim-1(Homo sapiens (Human))
Tolero Pharmaceuticals
US Patent
LigandPNGBDBM242365(US10047093, 8-22 | US10392392, Example 8-22 | US10...)
Affinity DataIC50:  41nMT: 2°C. Assay description: These assays are set up in duplicate 50 ul volumes in white, flat bottom 96 well plates. Inhibitors are added to the solution of 1× kinase buff...
Ligand InfoPC cidPC sid
In DepthDetails US Patent
TargetSerine/threonine-protein kinase pim-1(Homo sapiens (Human))
Tolero Pharmaceuticals
US Patent
LigandPNGBDBM242365(US10047093, 8-22 | US10392392, Example 8-22 | US10...)
Affinity DataIC50:  41nM. Assay description: One illustrative manner in which Pim-1 kinase activity can be determined is by quantifying the amount of ATP remaining in solution after an in vitro ...
Ligand InfoPC cidPC sid
In DepthDetails US Patent
TargetSerine/threonine-protein kinase pim-1(Homo sapiens (Human))
Tolero Pharmaceuticals
US Patent
LigandPNGBDBM242365(US10047093, 8-22 | US10392392, Example 8-22 | US10...)
Affinity DataIC50:  41nM. Assay description: One illustrative manner in which Pim-1 kinase activity can be determined is by quantifying the amount of ATP remaining in solution after an in vitro ...
Ligand InfoPC cidPC sid
In DepthDetails US Patent
TargetSerine/threonine-protein kinase pim-1(Homo sapiens (Human))
Tolero Pharmaceuticals
US Patent
LigandPNGBDBM242365(US10047093, 8-22 | US10392392, Example 8-22 | US10...)
Affinity DataIC50:  41nMT: 2°C. Assay description: One illustrative manner in which Pim-1 kinase activity can be determined is by quantifying the amount of ATP remaining in solution after an in vitro ...
Ligand InfoPC cidPC sid
In DepthDetails US Patent