BDBM242894 US9427442, 22
SMILES C[C@H](C[C@@H]([C@@H](CCC(F)(F)F)C(=O)N[C@H]1N=C(c2ccccc2)c2cccc(Cl)c2NC1=O)C(N)=O)C(F)(F)F
InChI Key InChIKey=VPJBPAOAPXODSK-BRTNZQBZSA-N
Data  2 IC50
  Tab Delimited (TSV)   2D SDfile   Computed 3D by Vconf -m prep SDfile
Find this compound or compounds like it in BindingDB:
Activity Spreadsheet -- Enzyme Inhibition Constant Data from BindingDB
Found 2 hits for monomerid = 242894
LigandPNGBDBM242894(US9427442, 22)
Affinity DataIC50:  9.30nM. Assay description: The Notch-CBF1 (C-promoter binding factor I) cell based transactivation assay is based on the ability of the released Notch intracellular domain frag...
Ligand InfoPC cidPC sid
In DepthDetails US Patent
LigandPNGBDBM242894(US9427442, 22)
Affinity DataIC50:  3.20nM. Assay description: The Notch-CBF1 (C-promoter binding factor I) cell based transactivation assay is based on the ability of the released Notch intracellular domain frag...
Ligand InfoPC cidPC sid
In DepthDetails US Patent