BDBM243391 5-chloro-N2-(2-(2-(dimethylaminoethyl)-7-methoxy-1,2,3,4-tetrahydroisoquinolin-6-yl)-N4-2-(isopropylsulfonyl)phenyl)pyrimidine-2,4-diamine::US10053458, 23
SMILES COc1cc2CN(CCN(C)C)CCc2cc1Nc1ncc(Cl)c(Nc2ccccc2S(=O)(=O)C(C)C)n1
InChI Key InChIKey=HULYGZZDVZJGOH-UHFFFAOYSA-N
Data  4 IC50
  Tab Delimited (TSV)   2D SDfile   Computed 3D by Vconf -m prep SDfile
Find this compound or compounds like it in BindingDB:
Activity Spreadsheet -- Enzyme Inhibition Constant Data from BindingDB
Found 4 hits for monomerid = 243391
TargetALK tyrosine kinase receptor(Homo sapiens (Human))
Korea Research Institute Of Chemical Technology
US Patent
LigandPNGBDBM243391(5-chloro-N2-(2-(2-(dimethylaminoethyl)-7-methoxy-1...)
Affinity DataIC50: <10nMT: 2°C. Assay description: A proliferation inhibitory activity against the ALK of the compound represented by Chemical Formula 1 according to the present invention at an enzyme...
Ligand InfoPC cidPC sid
In DepthDetails US Patent
TargetALK tyrosine kinase receptor(Homo sapiens (Human))
Korea Research Institute Of Chemical Technology
US Patent
LigandPNGBDBM243391(5-chloro-N2-(2-(2-(dimethylaminoethyl)-7-methoxy-1...)
Affinity DataIC50:  1.18E+3nM. Assay description: Inhibition of crizotinib-resistant ALK L1196M mutant (unknown origin) using peptide substrate incubated for 30 mins in presence of ATP by fluorescenc...
Ligand InfoPC cidPC sid
In DepthDetails ArticlePubMed
TargetALK tyrosine kinase receptor(Homo sapiens (Human))
Korea Research Institute Of Chemical Technology
US Patent
LigandPNGBDBM243391(5-chloro-N2-(2-(2-(dimethylaminoethyl)-7-methoxy-1...)
Affinity DataIC50:  18nM. Assay description: Inhibition of ALK (unknown origin) using peptide substrate incubated for 30 mins in presence of ATP by fluorescence assay
Ligand InfoPC cidPC sid
In DepthDetails ArticlePubMed
TargetALK tyrosine kinase receptor [L1196M](Homo sapiens (Human))
Korea Research Institute Of Chemical Technology
US Patent
LigandPNGBDBM243391(5-chloro-N2-(2-(2-(dimethylaminoethyl)-7-methoxy-1...)
Affinity DataIC50: <10nM
Ligand InfoPC cidPC sid
In DepthDetails US Patent